Target
Adenosine kinase
Ligand
BDBM50095366
Substrate
Meas. Tech.
ChEMBL_31128 (CHEMBL643556)
IC50
0.170000±n/a nM
Citation
 Cowart, MLee, CHGfesser, GABayburt, EKBhagwat, SSStewart, AOYu, HKohlhaas, KLMcGaraughty, SWismer, CTMikusa, JZhu, CAlexander, KMJarvis, MFKowaluk, EA Structure-activity studies of 5-substituted pyridopyrimidines as adenosine kinase inhibitors. Bioorg Med Chem Lett 11:83-6 (2001)  
Target
Name:
Adenosine kinase
Synonyms:
ADENOSINE Adenosine 5-phosphotransferase Adenosine kinase | Adk
Type:
Enzyme
Mol. Mass.:
40130.14
Organism:
Rattus norvegicus (rat)
Description:
Rat brain cytosol as enzyme source.
Residue:
361
  
Inhibitor
Name:
BDBM50095366
Synonyms:
5-(2-Bromo-benzyl)-7-(6-morpholin-4-yl-pyridin-3-yl)-pyrido[2,3-d]pyrimidin-4-ylamine | CHEMBL169457
Type:
Small organic molecule
Emp. Form.:
C23H21BrN6O
Mol. Mass.:
477.356
SMILES:
Nc1ncnc2nc(cc(Cc3ccccc3Br)c12)-c1ccc(nc1)N1CCOCC1
: