Target
Muscarinic acetylcholine receptor M3
Ligand
BDBM50095664
Substrate
Meas. Tech.
ChEMBL_138696 (CHEMBL747663)
Ki
6.9±n/a nM
Citation
 Mitsuya, MKobayashi, KKawakami, KSatoh, AOgino, YKakikawa, TOhtake, NKimura, THirose, HSato, ANumazawa, THasegawa, TNoguchi, KMase, T A potent, long-acting, orally active (2R)-2-[(1R)-3, 3-difluorocyclopentyl]-2-hydroxy-2-phenylacetamide: novel muscarinic M(3) receptor antagonist with high selectivity for M(3) over M(2) receptors. J Med Chem 43:5017-29 (2001)  
Target
Name:
Muscarinic acetylcholine receptor M3
Synonyms:
ACM3_HUMAN Cholinergic, muscarinic M3 Muscarinic receptor M3 | RecName: Full=Muscarinic acetylcholine receptor M3
Type:
Enzyme
Mol. Mass.:
66151.03
Organism:
Homo sapiens (Human)
Description:
P20309
Residue:
590
  
Inhibitor
Name:
BDBM50095664
Synonyms:
CHEMBL422665 | N-[1-(3-Amino-benzyl)-piperidin-4-yl]-2-(3,3-difluoro-cyclopentyl)-2-hydroxy-2-phenyl-acetamide
Type:
Small organic molecule
Emp. Form.:
C25H31F2N3O2
Mol. Mass.:
443.5293
SMILES:
Nc1cccc(CN2CCC(CC2)NC(=O)[C@@](O)([C@@H]2CCC(F)(F)C2)c2ccccc2)c1
: