Target
Muscarinic acetylcholine receptor M1
Ligand
BDBM50095662
Substrate
Meas. Tech.
ChEMBL_138399 (CHEMBL744762)
Ki
1.4±n/a nM
Citation
 Mitsuya, MKobayashi, KKawakami, KSatoh, AOgino, YKakikawa, TOhtake, NKimura, THirose, HSato, ANumazawa, THasegawa, TNoguchi, KMase, T A potent, long-acting, orally active (2R)-2-[(1R)-3, 3-difluorocyclopentyl]-2-hydroxy-2-phenylacetamide: novel muscarinic M(3) receptor antagonist with high selectivity for M(3) over M(2) receptors. J Med Chem 43:5017-29 (2001)  
Target
Name:
Muscarinic acetylcholine receptor M1
Synonyms:
ACM1_HUMAN Cholinergic receptor, muscarinic 1 | Cholinergic, muscarinic M1
Type:
Protein
Mol. Mass.:
51442.54
Organism:
Homo sapiens (Human)
Description:
P11229
Residue:
460
  
Inhibitor
Name:
BDBM50095662
Synonyms:
2-Cyclopentyl-2-hydroxy-N-[1-(3-methyl-benzyl)-piperidin-4-yl]-2-phenyl-acetamide | CHEMBL358726
Type:
Small organic molecule
Emp. Form.:
C26H34N2O2
Mol. Mass.:
406.5604
SMILES:
Cc1cccc(CN2CCC(CC2)NC(=O)C(O)(C2CCCC2)c2ccccc2)c1
: