Target
Muscarinic acetylcholine receptor M2
Ligand
BDBM50095670
Substrate
Meas. Tech.
ChEMBL_139640 (CHEMBL748253)
Ki
260±n/a nM
Citation
 Mitsuya, MKobayashi, KKawakami, KSatoh, AOgino, YKakikawa, TOhtake, NKimura, THirose, HSato, ANumazawa, THasegawa, TNoguchi, KMase, T A potent, long-acting, orally active (2R)-2-[(1R)-3, 3-difluorocyclopentyl]-2-hydroxy-2-phenylacetamide: novel muscarinic M(3) receptor antagonist with high selectivity for M(3) over M(2) receptors. J Med Chem 43:5017-29 (2001)  
Target
Name:
Muscarinic acetylcholine receptor M2
Synonyms:
ACM2_HUMAN Cholinergic, muscarinic M2 Muscarinic acetylcholine receptor M2 and M5 | RecName: Full=Muscarinic acetylcholine receptor M2
Type:
GPCR
Mol. Mass.:
51730.61
Organism:
Homo sapiens (Human)
Description:
P08172
Residue:
466
  
Inhibitor
Name:
BDBM50095670
Synonyms:
CHEMBL147653 | N-(1-Benzyl-piperidin-4-yl)-2-(3,3-difluoro-cyclopentyl)-2-hydroxy-2-phenyl-acetamide
Type:
Small organic molecule
Emp. Form.:
C25H30F2N2O2
Mol. Mass.:
428.5147
SMILES:
O[C@@]([C@@H]1CCC(F)(F)C1)(C(=O)NC1CCN(Cc2ccccc2)CC1)c1ccccc1
: