Target
Reverse transcriptase/RNaseH
Ligand
BDBM1656
Substrate
Meas. Tech.
ChEMBL_195341 (CHEMBL802583)
IC50
450±n/a nM
Citation
 Rizzo, RCTirado-Rives, JJorgensen, WL Estimation of binding affinities for HEPT and nevirapine analogues with HIV-1 reverse transcriptase via Monte Carlo simulations. J Med Chem 44:145-54 (2001)  
Target
Name:
Reverse transcriptase/RNaseH
Synonyms:
HIV-1 Reverse Transcriptase RNase H Reverse transcriptase/RNaseH
Type:
PROTEIN
Mol. Mass.:
65229.15
Organism:
Human immunodeficiency virus 1
Description:
ChEMBL_1473730
Residue:
566
  
Inhibitor
Name:
BDBM1656
Synonyms:
9-methyl-2-propyl-2,4,9,15-tetraazatricyclo[9.4.0.0^{3,8}]pentadeca-1(11),3(8),4,6,12,14-hexaen-10-one Dipyridodiazepinone deriv. 74
Type:
Small organic molecule
Emp. Form.:
C15H16N4O
Mol. Mass.:
268.3137
SMILES:
CCCN1c2ncccc2N(C)C(=O)c2cccnc12
: