Target
Adenosine receptor A1
Ligand
BDBM50095781
Substrate
Meas. Tech.
ChEMBL_27568 (CHEMBL637242)
Ki
27±n/a nM
Citation
 Harada, HAsano, OHoshino, YYoshikawa, SMatsukura, MKabasawa, YNiijima, JKotake, YWatanabe, NKawata, TInoue, THorizoe, TYasuda, NMinami, HNagata, KMurakami, MNagaoka, JKobayashi, STanaka, IAbe, S 2-Alkynyl-8-aryl-9-methyladenines as novel adenosine receptor antagonists: their synthesis and structure-activity relationships toward hepatic glucose production induced via agonism of the A(2B) receptor. J Med Chem 44:170-9 (2001)  
Target
Name:
Adenosine receptor A1
Synonyms:
A1 adenosine receptor (hA1) AA1R_HUMAN ADORA1 Adenosine A1-receptor Adenosine receptor A1 (hA1) | Adenosine transporter (AdT)
Type:
G Protein-Coupled Receptor (GPCR)
Mol. Mass.:
36520.92
Organism:
Homo sapiens (Human)
Description:
P30542
Residue:
326
  
Inhibitor
Name:
BDBM50095781
Synonyms:
1-[6-Amino-8-(3-fluoro-phenyl)-9-methyl-9H-purin-2-ylethynyl]-cycloheptanol | CHEMBL296389
Type:
Small organic molecule
Emp. Form.:
C21H22FN5O
Mol. Mass.:
379.4307
SMILES:
Cn1c(nc2c(N)nc(nc12)C#CC1(O)CCCCCC1)-c1cccc(F)c1
: