Target
Adenosine receptor A2a
Ligand
BDBM50095790
Substrate
Meas. Tech.
ChEMBL_31349 (CHEMBL641570)
Ki
9.8±n/a nM
Citation
 Harada, HAsano, OHoshino, YYoshikawa, SMatsukura, MKabasawa, YNiijima, JKotake, YWatanabe, NKawata, TInoue, THorizoe, TYasuda, NMinami, HNagata, KMurakami, MNagaoka, JKobayashi, STanaka, IAbe, S 2-Alkynyl-8-aryl-9-methyladenines as novel adenosine receptor antagonists: their synthesis and structure-activity relationships toward hepatic glucose production induced via agonism of the A(2B) receptor. J Med Chem 44:170-9 (2001)  
Target
Name:
Adenosine receptor A2a
Synonyms:
A2A adenosine receptor (hA2A) ADENOSINE A2 ADORA2 Adenosine A2A receptor (A2AAR)
Type:
G Protein-Coupled Receptor (GPCR)
Mol. Mass.:
44716.46
Organism:
Homo sapiens (Human)
Description:
P29274
Residue:
412
  
Inhibitor
Name:
BDBM50095790
Synonyms:
1-[6-Amino-8-(3-fluoro-phenyl)-9-methyl-9H-purin-2-ylethynyl]-cyclopentanol | CHEMBL297685
Type:
Small organic molecule
Emp. Form.:
C19H18FN5O
Mol. Mass.:
351.3775
SMILES:
Cn1c(nc2c(N)nc(nc12)C#CC1(O)CCCC1)-c1cccc(F)c1
: