Target
Tyrosine-protein kinase JAK1
Ligand
BDBM159748
Substrate
Meas. Tech.
ChEMBL_1979484 (CHEMBL4612619)
IC50
5.1±n/a nM
Citation
 Hansen, BBJepsen, THLarsen, MSindet, RVifian, TBurhardt, MNLarsen, JSeitzberg, JGCarnerup, MAJerre, AMølck, CLovato, PRai, SNasipireddy, VRRitzén, A Fragment-Based Discovery of Pyrazolopyridones as JAK1 Inhibitors with Excellent Subtype Selectivity. J Med Chem 63:7008-7032 (2020)  
Target
Name:
Tyrosine-protein kinase JAK1
Synonyms:
JAK-1 JAK1A JAK1_HUMAN Janus kinase 1 (JAK1) | Janus kinase 1 JAK1
Type:
Protein
Mol. Mass.:
133293.73
Organism:
Homo sapiens (Human)
Description:
P23458
Residue:
1154
  
Inhibitor
Name:
BDBM159748
Synonyms:
US10966980, Example 2 | US9035074, 2
Type:
Small organic molecule
Emp. Form.:
C14H21N5O2S
Mol. Mass.:
323.414
SMILES:
CCCS(=O)(=O)N[C@H]1C[C@H](C1)N(C)c1ncnc2[nH]ccc12
: