Target
Tyrosine-protein kinase JAK3
Ligand
BDBM159748
Substrate
Meas. Tech.
ChEMBL_1979488 (CHEMBL4612623)
IC50
480±n/a nM
Citation
 Hansen, BBJepsen, THLarsen, MSindet, RVifian, TBurhardt, MNLarsen, JSeitzberg, JGCarnerup, MAJerre, AMølck, CLovato, PRai, SNasipireddy, VRRitzén, A Fragment-Based Discovery of Pyrazolopyridones as JAK1 Inhibitors with Excellent Subtype Selectivity. J Med Chem 63:7008-7032 (2020)  
Target
Name:
Tyrosine-protein kinase JAK3
Synonyms:
JAK-3 JAK3_HUMAN Janus kinase 3 (JAK3) L-JAK | Leukocyte janus kinase
Type:
Protein
Mol. Mass.:
125111.08
Organism:
Homo sapiens (Human)
Description:
P52333
Residue:
1124
  
Inhibitor
Name:
BDBM159748
Synonyms:
US10966980, Example 2 | US9035074, 2
Type:
Small organic molecule
Emp. Form.:
C14H21N5O2S
Mol. Mass.:
323.414
SMILES:
CCCS(=O)(=O)N[C@H]1C[C@H](C1)N(C)c1ncnc2[nH]ccc12
: