Target
AMP deaminase 3
Ligand
BDBM50087377
Substrate
Meas. Tech.
ChEMBL_31886 (CHEMBL645676)
Ki
500±n/a nM
Citation
 Kasibhatla, SRBookser, BCXiao, WErion, MD AMP deaminase inhibitors. 5. Design, synthesis, and SAR of a highly potent inhibitor series. J Med Chem 44:613-8 (2001)  
Target
Name:
AMP deaminase 3
Synonyms:
AMP deaminase 3 AMPD3 | AMPD3_HUMAN
Type:
Protein
Mol. Mass.:
88818.80
Organism:
Homo sapiens (Human)
Description:
Residue:
767
  
Inhibitor
Name:
BDBM50087377
Synonyms:
3-[2-(8-Hydroxy-7,8-dihydro-6H-imidazo[4,5-d][1,3]diazepin-3-yl)-ethyl]-benzoic acid CHEMBL35524
Type:
Small organic molecule
Emp. Form.:
C15H16N4O3
Mol. Mass.:
300.3125
SMILES:
OC1CNC=Nc2c1ncn2CCc1cccc(c1)C(O)=O
: