Target
C-C chemokine receptor type 5
Ligand
BDBM50096512
Substrate
Meas. Tech.
ChEBML_85970
IC50
100±n/a nM
Citation
 Dorn, CPFinke, PEOates, BBudhu, RJMills, SGMacCoss, MMalkowitz, LSpringer, MSDaugherty, BLGould, SLDeMartino, JASiciliano, SJCarella, ACarver, GHolmes, KDanzeisen, RHazuda, DKessler, JLineberger, JMiller, MSchleif, WAEmini, EA Antagonists of the human CCR5 receptor as anti-HIV-1 agents. part 1: discovery and initial structure-activity relationships for 1 -amino-2-phenyl-4-(piperidin-1-yl)butanes. Bioorg Med Chem Lett 11:259-64 (2001)  
Target
Name:
C-C chemokine receptor type 5
Synonyms:
C-C CKR-5 CC-CKR-5 CCR5 CCR5_HUMAN CHEMR13 HIV-1 fusion coreceptor
Type:
Enzyme
Mol. Mass.:
40540.21
Organism:
Homo sapiens (Human)
Description:
P51681
Residue:
352
  
Inhibitor
Name:
BDBM50096512
Synonyms:
1'-[3-(3,4-dichlorophenyl)-4-methyl(phenyl)sulfonamido-(3S)-butyl]spiro[2,3-dihydrobenzo[b]thiophene-1,1-dioxide-3,4'-(hexahydropyridine)] | CHEMBL421356
Type:
Small organic molecule
Emp. Form.:
C29H32Cl2N2O4S2
Mol. Mass.:
607.611
SMILES:
CN(C[C@@H](CCN1CCC2(CS(=O)(=O)c3ccccc23)CC1)c1ccc(Cl)c(Cl)c1)S(=O)(=O)c1ccccc1
: