Target
Prothrombin
Ligand
BDBM50096624
Substrate
Meas. Tech.
ChEMBL_32964 (CHEMBL644679)
IC50
0.100000±n/a nM
Citation
 Bachand, BTarazi, MSt-Denis, YEdmunds, JJWinocour, PDLeblond, LSiddiqui, MA Potent and selective bicyclic lactam inhibitors of thrombin. Part 4: transition state inhibitors. Bioorg Med Chem Lett 11:287-90 (2001)  
Target
Name:
Prothrombin
Synonyms:
Activation peptide fragment 1 Coagulation factor II Prothrombin precursor Thrombin heavy chain | Thrombin light chain
Type:
Protein
Mol. Mass.:
70029.57
Organism:
Homo sapiens (Human)
Description:
P00734
Residue:
622
  
Inhibitor
Name:
BDBM50096624
Synonyms:
3-(4-Amino-cyclohexyl)-2-oxo-3-[((6S,8aS)-4-oxo-2-phenylmethanesulfonyl-octahydro-pyrrolo[1,2-a]pyrazine-6-carbonyl)-amino]-propionic acid butyl ester | CHEMBL3084831
Type:
Small organic molecule
Emp. Form.:
C28H40N4O7S
Mol. Mass.:
576.705
SMILES:
[H][C@@]12CC[C@H](N1C(=O)CN(C2)S(=O)(=O)Cc1ccccc1)C(=O)NC([C@H]1CC[C@H](N)CC1)C(=O)C(=O)OCCCC
: