Target
Somatostatin receptor type 2
Ligand
BDBM50096827
Substrate
Meas. Tech.
ChEBML_200365
Ki
10±n/a nM
Citation
 Zhou, CGuo, LMorriello, GPasternak, APan, YRohrer, SPBirzin, ETHuskey, SEJacks, TSchleim, KDCheng, KSchaeffer, JMPatchett, AAYang, L Nipecotic and iso-nipecotic amides as potent and selective somatostatin subtype-2 receptor agonists. Bioorg Med Chem Lett 11:415-7 (2001)  
Target
Name:
Somatostatin receptor type 2
Synonyms:
SOMATOSTATIN SST2 SS-2-R SS2R SSTR2 | Somatostatin receptor type 2 (SSTR2)
Type:
Enzyme
Mol. Mass.:
41344.94
Organism:
Homo sapiens (Human)
Description:
P30874
Residue:
369
  
Inhibitor
Name:
BDBM50096827
Synonyms:
(S)-6-Amino-2-((S)-3-(1H-indol-3-yl)-2-{[1-(3-methoxy-benzyl)-piperidine-3-carbonyl]-amino}-butyrylamino)-hexanoic acid tert-butyl ester | CHEMBL446165
Type:
Small organic molecule
Emp. Form.:
C36H51N5O5
Mol. Mass.:
633.8206
SMILES:
COc1cccc(CN2CCCC(C2)C(=O)NC([C@@H](C)c2c[nH]c3ccccc23)C(=O)N[C@@H](CCCCN)C(=O)OC(C)(C)C)c1
: