Target
Bifunctional glutamate/proline--tRNA ligase
Ligand
BDBM50097096
Substrate
Meas. Tech.
ChEMBL_223471 (CHEMBL844881)
Ki
5.1±n/a nM
Citation
 Yu, XYHill, JMYu, GYang, YKluge, AFKeith, DFinn, JGallant, PSilverman, JLim, A A series of quinoline analogues as potent inhibitors of C. albicans prolyl tRNA synthetase. Bioorg Med Chem Lett 11:541-4 (2001)  
Target
Name:
Bifunctional glutamate/proline--tRNA ligase
Synonyms:
Aminoacyl-tRNA synthetase EPRS GLNS Glutamyl-tRNA synthetase Proliferation-inducing gene 32 protein QARS SYEP_HUMAN
Type:
PROTEIN
Mol. Mass.:
170602.50
Organism:
Homo sapiens (Human)
Description:
ChEMBL_223474
Residue:
1512
  
Inhibitor
Name:
BDBM50097096
Synonyms:
2-(4-Bromo-phenyl)-6-chloro-8-methyl-quinoline-4-carboxylic acid | CHEMBL357355
Type:
Small organic molecule
Emp. Form.:
C17H11BrClNO2
Mol. Mass.:
376.632
SMILES:
Cc1cc(Cl)cc2c(cc(nc12)-c1ccc(Br)cc1)C(O)=O
: