Target
Bifunctional glutamate/proline--tRNA ligase
Ligand
BDBM50097099
Substrate
Meas. Tech.
ChEBML_223472
IC50
95000±n/a nM
Citation
 Yu, XYHill, JMYu, GYang, YKluge, AFKeith, DFinn, JGallant, PSilverman, JLim, A A series of quinoline analogues as potent inhibitors of C. albicans prolyl tRNA synthetase. Bioorg Med Chem Lett 11:541-4 (2001)  
Target
Name:
Bifunctional glutamate/proline--tRNA ligase
Synonyms:
Aminoacyl-tRNA synthetase EPRS GLNS Glutamyl-tRNA synthetase Proliferation-inducing gene 32 protein QARS SYEP_HUMAN
Type:
PROTEIN
Mol. Mass.:
170602.50
Organism:
Homo sapiens (Human)
Description:
ChEMBL_223474
Residue:
1512
  
Inhibitor
Name:
BDBM50097099
Synonyms:
6-Amino-2-(4-bromo-phenyl)-quinoline-4-carboxylic acid | CHEMBL356452
Type:
Small organic molecule
Emp. Form.:
C16H11BrN2O2
Mol. Mass.:
343.175
SMILES:
Nc1ccc2nc(cc(C(O)=O)c2c1)-c1ccc(Br)cc1
: