Target
Bifunctional glutamate/proline--tRNA ligase
Ligand
BDBM50097105
Substrate
Meas. Tech.
ChEBML_223472
IC50
>20000±n/a nM
Citation
 Yu, XYHill, JMYu, GYang, YKluge, AFKeith, DFinn, JGallant, PSilverman, JLim, A A series of quinoline analogues as potent inhibitors of C. albicans prolyl tRNA synthetase. Bioorg Med Chem Lett 11:541-4 (2001)  
Target
Name:
Bifunctional glutamate/proline--tRNA ligase
Synonyms:
Aminoacyl-tRNA synthetase EPRS GLNS Glutamyl-tRNA synthetase Proliferation-inducing gene 32 protein QARS SYEP_HUMAN
Type:
PROTEIN
Mol. Mass.:
170602.50
Organism:
Homo sapiens (Human)
Description:
ChEMBL_223474
Residue:
1512
  
Inhibitor
Name:
BDBM50097105
Synonyms:
6-Bromo-2-(4-bromo-phenyl)-quinoline-4-carboxylic acid | CHEMBL153347
Type:
Small organic molecule
Emp. Form.:
C16H9Br2NO2
Mol. Mass.:
407.056
SMILES:
OC(=O)c1cc(nc2ccc(Br)cc12)-c1ccc(Br)cc1
: