Target
Bifunctional glutamate/proline--tRNA ligase
Ligand
BDBM50097107
Substrate
Meas. Tech.
ChEBML_223472
IC50
60000±n/a nM
Citation
 Yu, XYHill, JMYu, GYang, YKluge, AFKeith, DFinn, JGallant, PSilverman, JLim, A A series of quinoline analogues as potent inhibitors of C. albicans prolyl tRNA synthetase. Bioorg Med Chem Lett 11:541-4 (2001)  
Target
Name:
Bifunctional glutamate/proline--tRNA ligase
Synonyms:
Aminoacyl-tRNA synthetase EPRS GLNS Glutamyl-tRNA synthetase Proliferation-inducing gene 32 protein QARS SYEP_HUMAN
Type:
PROTEIN
Mol. Mass.:
170602.50
Organism:
Homo sapiens (Human)
Description:
ChEMBL_223474
Residue:
1512
  
Inhibitor
Name:
BDBM50097107
Synonyms:
2-(4-Bromo-phenyl)-7-fluoro-8-methyl-quinoline-4-carboxylic acid | CHEMBL346646
Type:
Small organic molecule
Emp. Form.:
C17H11BrFNO2
Mol. Mass.:
360.177
SMILES:
Cc1c(F)ccc2c(cc(nc12)-c1ccc(Br)cc1)C(O)=O
: