Target
Telomerase reverse transcriptase
Ligand
BDBM50097318
Substrate
Meas. Tech.
ChEMBL_225404 (CHEMBL846602)
IC50
61000±n/a nM
Citation
 Sasaki, SEhara, TSakata, IFujino, YHarada, NKimura, JNakamura, HMaeda, M Development of novel telomerase inhibitors based on a bisindole unit. Bioorg Med Chem Lett 11:583-5 (2001)  
Target
Name:
Telomerase reverse transcriptase
Synonyms:
EST2 TERT TRT
Type:
PROTEIN
Mol. Mass.:
127099.03
Organism:
Homo sapiens (Human)
Description:
ChEMBL_1447029
Residue:
1132
  
Inhibitor
Name:
BDBM50097318
Synonyms:
CHEMBL155030 | Phosphoric acid 12-(2-{1-[2-(5-chloro-indol-1-yl)-ethyl]-1H-indol-3-yl}-acetylamino)-dodecyl ester phenyl ester; compound with triethyl-amine
Type:
Small organic molecule
Emp. Form.:
C38H47ClN3O5P
Mol. Mass.:
692.224
SMILES:
OP(=O)(OCCCCCCCCCCCCNC(=O)Cc1cn(CCn2ccc3cc(Cl)ccc23)c2ccccc12)Oc1ccccc1
: