Target
Cytosolic phospholipase A2 gamma
Ligand
BDBM17638
Substrate
Meas. Tech.
ChEBML_52417
IC50
>100000±n/a nM
Citation
 Seno, KOkuno, TNishi, KMurakami, YYamada, KNakamoto, SOno, T Pyrrolidine inhibitors of human cytosolic phospholipase A2. Part 2: synthesis of potent and crystallized 4-triphenylmethylthio derivative 'pyrrophenone'. Bioorg Med Chem Lett 11:587-90 (2001)  
Target
Name:
Cytosolic phospholipase A2 gamma
Synonyms:
PA24C_HUMAN Phospholipase A2 group IVC | cPLA2-gamma
Type:
PROTEIN
Mol. Mass.:
60942.45
Organism:
Homo sapiens (Human)
Description:
ChEMBL_52417
Residue:
541
  
Inhibitor
Name:
BDBM17638
Synonyms:
2-{1-[(4-chlorophenyl)carbonyl]-5-methoxy-2-methyl-1H-indol-3-yl}acetic acid Indocin US11478464, Compound Indomethacin US9271961, Indomethacin | indometacin
Type:
Small organic molecule
Emp. Form.:
C19H16ClNO4
Mol. Mass.:
357.788
SMILES:
COc1ccc2n(C(=O)c3ccc(Cl)cc3)c(C)c(CC(O)=O)c2c1
: