Target
Sodium-dependent serotonin transporter
Ligand
BDBM50010859
Substrate
Meas. Tech.
ChEBML_201497
Ki
5±n/a nM
Citation
 Runyon, SPSavage, JETaroua, MRoth, BLGlennon, RAWestkaemper, RB Influence of chain length and N-alkylation on the selective serotonin receptor ligand 9-(aminomethyl)-9,10-dihydroanthracene. Bioorg Med Chem Lett 11:655-8 (2001)  
Target
Name:
Sodium-dependent serotonin transporter
Synonyms:
5-HT Transporter 5HTT SC6A4_MOUSE Sert Sodium-dependent serotonin transporter | Solute carrier family 6 member 4
Type:
Enzyme Catalytic Domain
Mol. Mass.:
70044.92
Organism:
MOUSE
Description:
5-HT Transporter SLC6A4 MOUSE::Q60857
Residue:
630
  
Inhibitor
Name:
BDBM50010859
Synonyms:
CHEMBL11 IMIPRAMINE PAMOATE | Imipramin
Type:
Small organic molecule
Emp. Form.:
C19H24N2
Mol. Mass.:
280.4073
SMILES:
CN(C)CCCN1c2ccccc2CCc2ccccc12
: