Target
Prothrombin
Ligand
BDBM50097775
Substrate
Meas. Tech.
ChEBML_208308
Ki
1350±n/a nM
Citation
 Jones, SDLiebeschuetz, JWMorgan, PJMurray, CWRimmer, ADRoscoe, JMWaszkowycz, BWelsh, PMWylie, WAYoung, SCMartin, HMahler, JBrady, LWilkinson, K The design of phenylglycine containing benzamidine carboxamides as potent and selective inhibitors of factor Xa. Bioorg Med Chem Lett 11:733-6 (2001)  
Target
Name:
Prothrombin
Synonyms:
Activation peptide fragment 1 Coagulation factor II Prothrombin precursor Thrombin heavy chain | Thrombin light chain
Type:
Protein
Mol. Mass.:
70029.57
Organism:
Homo sapiens (Human)
Description:
P00734
Residue:
622
  
Inhibitor
Name:
BDBM50097775
Synonyms:
CHEMBL163578 | N-[(R)-2-(4-Benzyl-piperidin-1-yl)-2-oxo-1-phenyl-ethyl]-3-carbamimidoyl-benzamide
Type:
Small organic molecule
Emp. Form.:
C28H30N4O2
Mol. Mass.:
454.5634
SMILES:
NC(=N)c1cccc(c1)C(=O)N[C@@H](C(=O)N1CCC(Cc2ccccc2)CC1)c1ccccc1
: