Target
Retinoic acid receptor beta
Ligand
BDBM50097823
Substrate
Meas. Tech.
ChEMBL_195813 (CHEMBL807724)
Kd
6±n/a nM
Citation
 Beard, RLKlein, ESStandeven, AMEscobar, MChandraratna, RA Phenylcyclohexene and phenylcyclohexadiene substituted compounds having retinoid antagonist activity. Bioorg Med Chem Lett 11:765-8 (2001)  
Target
Name:
Retinoic acid receptor beta
Synonyms:
HAP NR1B2 RAR-beta RARB Retinoic acid receptor RXR-alpha/Retinoic acid receptor beta Retinoid receptor
Type:
PROTEIN
Mol. Mass.:
50498.70
Organism:
Homo sapiens (Human)
Description:
ChEMBL_1458015
Residue:
455
  
Inhibitor
Name:
BDBM50097823
Synonyms:
4-[(E)-4-(6,6-Dimethyl-2-p-tolyl-cyclohex-1-enyl)-but-3-en-1-ynyl]-benzoic acid | CHEMBL349018
Type:
Small organic molecule
Emp. Form.:
C26H26O2
Mol. Mass.:
370.4834
SMILES:
Cc1ccc(cc1)C1=C(\C=C\C#Cc2ccc(cc2)C(O)=O)C(C)(C)CCC1
: