Target
Histamine H3 receptor
Ligand
BDBM50092833
Substrate
Meas. Tech.
ChEBML_86751
Ki
4.9±n/a nM
Citation
 Stark, HSippl, WLigneau, XArrang, JMGanellin, CRSchwartz, JCSchunack, W Different antagonist binding properties of human and rat histamine H3 receptors. Bioorg Med Chem Lett 11:951-4 (2001)  
Target
Name:
Histamine H3 receptor
Synonyms:
HH3R Hrh3
Type:
G Protein-Coupled Receptor (GPCR)
Mol. Mass.:
48607.98
Organism:
Rattus norvegicus (rat)
Description:
Residue:
445
  
Inhibitor
Name:
BDBM50092833
Synonyms:
4-(3-Phenoxy-propyl)-1H-imidazole with (0.95M)oxalic acid CHEMBL128923
Type:
Small organic molecule
Emp. Form.:
C12H14N2O
Mol. Mass.:
202.2524
SMILES:
C(COc1ccccc1)Cc1cnc[nH]1
: