Target
Cathepsin B
Ligand
BDBM50066650
Substrate
Meas. Tech.
ChEMBL_216562 (CHEMBL822277)
Ki
1300±n/a nM
Target
Name:
Cathepsin B
Synonyms:
APP secretase CATB_HUMAN CTSB Cathepsin B light chain | Cathepsin B1
Type:
Enzyme
Mol. Mass.:
37819.69
Organism:
Homo sapiens (Human)
Description:
gi_63102437
Residue:
339
  
Inhibitor
Name:
BDBM50066650
Synonyms:
1,3-BIS[[N-[(PHENYLMETHOXY)CARBONYL]-L-LEUCYL]AMINO]-2-PROPANONE {(S)-1-[3-((S)-2-Benzyloxycarbonylamino-4-methyl-pentanoylamino)-2-oxo-propylcarbamoyl]-3-methyl-butyl}-carbamic acid benzyl ester | {1-[3-(2-Benzyloxycarbonylamino-4-methyl-pentanoylamino)-2-oxo-propylcarbamoyl]-3-methyl-butyl}-carbamic acid benzyl ester
Type:
Small organic molecule
Emp. Form.:
C31H42N4O7
Mol. Mass.:
582.6878
SMILES:
CC(C)C[C@H](NC(=O)OCc1ccccc1)C(=O)NCC(=O)CNC(=O)[C@H](CC(C)C)NC(=O)OCc1ccccc1
: