Target
Somatostatin receptor type 2
Ligand
BDBM50098610
Substrate
Meas. Tech.
ChEMBL_200678 (CHEMBL807090)
Kd
56.23±n/a nM
Citation
 Rajeswaran, WGHocart, SJMurphy, WATaylor, JECoy, DH N-Methyl scan of somatostatin octapeptide agonists produces interesting effects on receptor subtype specificity. J Med Chem 44:1416-21 (2001)  
Target
Name:
Somatostatin receptor type 2
Synonyms:
SOMATOSTATIN SST2 SS-2-R SS2R SSTR2 | Somatostatin receptor type 2 (SSTR2)
Type:
Enzyme
Mol. Mass.:
41344.94
Organism:
Homo sapiens (Human)
Description:
P30874
Residue:
369
  
Inhibitor
Name:
BDBM50098610
Synonyms:
10-(4-Amino-butyl)-19-[2-amino-3-(4-hydroxy-phenyl)-propionylamino]-16-benzyl-7-(1-hydroxy-ethyl)-13-(1H-indol-3-ylmethyl)-5-methyl-6,9,12,15,18-pentaoxo-1,2-dithia-5,8,11,14,17-pentaaza-cycloicosane-4-carboxylic acid (1-carbamoyl-2-hydroxy-propyl)-amide | CHEMBL384836
Type:
Small organic molecule
Emp. Form.:
C50H67N11O11S2
Mol. Mass.:
1062.264
SMILES:
C[C@@H](O)[C@H](NC(=O)[C@@H]1CSSC[C@@H](NC(=O)[C@H](N)Cc2ccc(O)cc2)C(=O)N[C@@H](Cc2ccccc2)C(=O)N[C@@H](Cc2c[nH]c3ccccc23)C(=O)N[C@@H](CCCCN)C(=O)N[C@@H]([C@@H](C)O)C(=O)N1C)C(N)=O
: