Target
Nitric oxide synthase, inducible
Ligand
BDBM50098942
Substrate
Meas. Tech.
ChEBML_51079
IC50
32000±n/a nM
Citation
 Beaton, HHamley, PNicholls, DJTinker, ACWallace, AV 3,4-Dihydro-1-isoquinolinamines: a novel class of nitric oxide synthase inhibitors with a range of isoform selectivity and potency. Bioorg Med Chem Lett 11:1023-6 (2001)  
Target
Name:
Nitric oxide synthase, inducible
Synonyms:
HEP-NOS Inducible NO synthase NOS type II NOS2A Nitric oxide synthase, inducible (iNOS) | iNOS
Type:
Homodimer
Mol. Mass.:
131141.95
Organism:
Homo sapiens (Human)
Description:
P35228
Residue:
1153
  
Inhibitor
Name:
BDBM50098942
Synonyms:
3,4-Dihydro-isoquinolin-1-ylamine | CHEMBL7891
Type:
Small organic molecule
Emp. Form.:
C9H10N2
Mol. Mass.:
146.1891
SMILES:
NC1=NCCc2ccccc12
: