Target
Lysosomal acid glucosylceramidase
Ligand
BDBM50099009
Substrate
Meas. Tech.
ChEBML_37421
Ki
25±n/a nM
Citation
 Wrodnigg, TMWithers, SGStütz, AE Novel, lipophilic derivatives of 2,5-dideoxy-2,5-imino-D-mannitol (DMDP) are powerful beta-glucosidase inhibitors. Bioorg Med Chem Lett 11:1063-4 (2001)  
Target
Name:
Lysosomal acid glucosylceramidase
Synonyms:
Acid beta-glucosidase Beta-glucocerebrosidase D-glucosyl-N-acylsphingosine glucohydrolase GBA1 GC GLUC Glucosylceramidase (GBA) Glucosylceramidase precursor (Beta-glucocerebrosidase) (Acid beta-glucosidase) (D-glucosyl-N-acylsphingosine glucohydrolase) (Alglucerase) (Imiglucerase) beta-glucocerebrosidase (GCase)
Type:
Enzyme
Mol. Mass.:
59724.64
Organism:
Homo sapiens (Human)
Description:
The beta-Glu activity was measured with commercially available beta-glucocerebrosidase (Ceredase) as the enzyme source.
Residue:
536
  
Inhibitor
Name:
BDBM50099009
Synonyms:
(3S,4S,5R)-2-Aminomethyl-5-hydroxymethyl-pyrrolidine-3,4-diol CHEMBL3350086
Type:
Small organic molecule
Emp. Form.:
C6H14N2O3
Mol. Mass.:
162.187
SMILES:
NC[C@H]1N[C@H](CO)[C@H](O)[C@@H]1O
: