Target
Protein kinase C delta type
Ligand
BDBM50057509
Substrate
Meas. Tech.
ChEBML_217858
Ki
114±n/a nM
Citation
 Qiao, LZhao, LYRong, SBWu, XWWang, SFujii, TKazanietz, MGRauser, LSavage, JRoth, BLFlippen-Anderson, JKozikowski, AP Rational design, synthesis, and biological evaluation of rigid pyrrolidone analogues as potential inhibitors of prostate cancer cell growth. Bioorg Med Chem Lett 11:955-9 (2001)  
Target
Name:
Protein kinase C delta type
Synonyms:
KPCD_HUMAN PKCD Protein Kinase C- delta nPKC-delta
Type:
Enzyme
Mol. Mass.:
77516.79
Organism:
Homo sapiens (Human)
Description:
The recombinant human PKC enzymes were produced using a baculovirus expression system in SF9 cells
Residue:
676
  
Inhibitor
Name:
BDBM50057509
Synonyms:
(2S,5S)-8-Dec-1-ynyl-5-hydroxymethyl-2-isopropyl-1-methyl-1,4,5,6-tetrahydro-2H-benzo[e][1,4]diazocin-3-one CHEMBL6453
Type:
Small organic molecule
Emp. Form.:
C25H38N2O2
Mol. Mass.:
398.5814
SMILES:
CCCCCCCCC#Cc1ccc2N(C)[C@@H](C(C)C)C(=O)N[C@H](CO)Cc2c1
: