Target
Protein kinase C epsilon type
Ligand
BDBM50099066
Substrate
Meas. Tech.
ChEBML_216270
Ki
0.450000±n/a nM
Citation
 Qiao, LZhao, LYRong, SBWu, XWWang, SFujii, TKazanietz, MGRauser, LSavage, JRoth, BLFlippen-Anderson, JKozikowski, AP Rational design, synthesis, and biological evaluation of rigid pyrrolidone analogues as potential inhibitors of prostate cancer cell growth. Bioorg Med Chem Lett 11:955-9 (2001)  
Target
Name:
Protein kinase C epsilon type
Synonyms:
KPCE_HUMAN PKCE Protein kinase C epsilon Protein kinase C, PKC; classical/novel nPKC-epsilon
Type:
Enzyme
Mol. Mass.:
83680.45
Organism:
Homo sapiens (Human)
Description:
The recombinant human PKC enzymes were produced using a baculovirus expression system in SF9 cells
Residue:
737
  
Inhibitor
Name:
BDBM50099066
Synonyms:
CHEMBL279115 | phorbol 13-acetate 12-myristate
Type:
Small organic molecule
Emp. Form.:
C36H56O8
Mol. Mass.:
616.825
SMILES:
CCCCCCCCCCCCCC(=O)O[C@@H]1[C@@H](C)[C@]2(O)[C@@H]3C=C(C)C(=O)[C@@]3(O)CC(CO)=C[C@H]2[C@@H]2C(C)(C)[C@]12OC(C)=O
: