Target
Neuropeptide Y receptor type 4
Ligand
BDBM50034121
Substrate
Meas. Tech.
ChEMBL_140794 (CHEMBL752933)
Ki
5.8±n/a nM
Citation
 Balasubramaniam, ADhawan, VCMullins, DEChance, WTSheriff, SGuzzi, MPrabhakaran, MParker, EM Highly selective and potent neuropeptide Y (NPY) Y1 receptor antagonists based on [Pro(30), Tyr(32), Leu(34)]NPY(28-36)-NH2 (BW1911U90). J Med Chem 44:1479-82 (2001)  
Target
Name:
Neuropeptide Y receptor type 4
Synonyms:
NPY-Y4 NPY4R PP1 Pancreatic polypeptide receptor 1
Type:
Enzyme Catalytic Domain
Mol. Mass.:
42207.58
Organism:
Homo sapiens (Human)
Description:
NPY-Y4 PPYR1 HUMAN::P50391
Residue:
375
  
Inhibitor
Name:
BDBM50034121
Synonyms:
CHEMBL386823 | Ile-Asn-Pro-Ile-Tyr-Arg-Leu-Arg-Tyr-NH2
Type:
Small organic molecule
Emp. Form.:
C57H91N17O12
Mol. Mass.:
1206.4391
SMILES:
CC[C@H](C)[C@H](N)C(=O)N[C@@H](CC(N)=O)C(=O)N1CCC[C@H]1C(=O)N[C@@H]([C@@H](C)CC)C(=O)N[C@@H](Cc1ccc(O)cc1)C(=O)N[C@@H](CCCNC(N)=N)C(=O)N[C@@H](CC(C)C)C(=O)N[C@@H](CCCNC(N)=N)C(=O)N[C@@H](Cc1ccc(O)cc1)C(N)=O
: