Target
Sodium-dependent serotonin transporter
Ligand
BDBM50099233
Substrate
Meas. Tech.
ChEMBL_201808 (CHEMBL806802)
Ki
1.97±n/a nM
Citation
 Davies, HMGilliatt, VKuhn, LASaikali, ERen, PHammond, PSSexton, TChilders, SR Synthesis of 2beta-acyl-3beta-(substituted naphthyl)-8-azabicyclo[3.2.1]octanes and their binding affinities at dopamine and serotonin transport sites. J Med Chem 44:1509-15 (2001)  
Target
Name:
Sodium-dependent serotonin transporter
Synonyms:
5-HT Transporter 5HT transporter Anandamid membrane transporter, AMT Monoamine transporters; Norepinephrine & serotonin Slc6a4 Sodium-dependent serotonin transporter (SERT) | imipramine receptor
Type:
Multi-pass membrane protein
Mol. Mass.:
70168.43
Organism:
Rattus norvegicus (rat)
Description:
P31652
Residue:
630
  
Inhibitor
Name:
BDBM50099233
Synonyms:
1-[3-(6-Isopropyl-naphthalen-2-yl)-8-methyl-8-aza-bicyclo[3.2.1]oct-2-yl]-propan-1-one | CHEMBL416058
Type:
Small organic molecule
Emp. Form.:
C24H31NO
Mol. Mass.:
349.509
SMILES:
CCC(=O)C1C2CCC(CC1c1ccc3cc(ccc3c1)C(C)C)N2C
: