Target
Sigma non-opioid intracellular receptor 1
Ligand
BDBM21398
Substrate
Meas. Tech.
ChEMBL_202071 (CHEMBL811341)
Ki
1.5±n/a nM
Citation
 Huang, YLuedtke, RRFreeman, RAWu, LMach, RH Synthesis and structure-activity relationships of naphthamides as dopamine D3 receptor ligands. J Med Chem 44:1815-26 (2001)  
Target
Name:
Sigma non-opioid intracellular receptor 1
Synonyms:
Aging-associated gene 8 protein SGMR1_HUMAN SIGMAR1 SR31747-binding protein Sigma 1-type opioid receptor Sigma1R | hSigmaR1
Type:
Enzyme Catalytic Domain
Mol. Mass.:
25124.85
Organism:
Homo sapiens (Human)
Description:
Q99720
Residue:
223
  
Inhibitor
Name:
BDBM21398
Synonyms:
4-[4-(4-Chloro-phenyl)-4-hydroxy-piperidin-1-yl]-1-(4-fluoro-phenyl)-butan-1-one;propionate(HCl) CHEMBL54 Haloperidol | Haloperidol, 1
Type:
Small organic molecule
Emp. Form.:
C21H23ClFNO2
Mol. Mass.:
375.864
SMILES:
OC1(CCN(CCCC(=O)c2ccc(F)cc2)CC1)c1ccc(Cl)cc1
: