Target
Muscarinic acetylcholine receptor M4
Ligand
BDBM50075360
Substrate
Meas. Tech.
ChEBML_139258
Ki
>10000±n/a nM
Citation
 Huang, YKegeles, LSBae, SHwang, DRoth, BLSavage, JELaruelle, M Synthesis of potent and selective dopamine D(4) antagonists as candidate radioligands. Bioorg Med Chem Lett 11:1375-7 (2001)  
Target
Name:
Muscarinic acetylcholine receptor M4
Synonyms:
ACM4_HUMAN Cholinergic, muscarinic M4 Muscarinic acetylcholine receptor M2 and M4
Type:
Enzyme Catalytic Domain
Mol. Mass.:
53079.31
Organism:
Homo sapiens (Human)
Description:
Cholinergic, muscarinic M4 CHRM4 HUMAN M3::P08173
Residue:
479
  
Inhibitor
Name:
BDBM50075360
Synonyms:
3-[4-(4-Methoxy-phenyl)-piperazin-1-ylmethyl]-1H-pyrrolo[2,3-b]pyridine | CHEMBL28607
Type:
Small organic molecule
Emp. Form.:
C19H22N4O
Mol. Mass.:
322.4042
SMILES:
COc1ccc(cc1)N1CCN(Cc2c[nH]c3ncccc23)CC1
: