Target
Adenosine kinase
Ligand
BDBM50090850
Substrate
Meas. Tech.
ChEMBL_31125 (CHEMBL643553)
IC50
15±n/a nM
Citation
 Lee, CHJiang, MCowart, MGfesser, GPerner, RKim, KHGu, YGWilliams, MJarvis, MFKowaluk, EAStewart, AOBhagwat, SS Discovery of 4-amino-5-(3-bromophenyl)-7-(6-morpholino-pyridin-3-yl)pyrido[2,3-d]pyrimidine, an orally active, non-nucleoside adenosine kinase inhibitor.. J Med Chem 44:2133-8 (2001)  
Target
Name:
Adenosine kinase
Synonyms:
ADENOSINE Adenosine 5-phosphotransferase Adenosine kinase | Adk
Type:
Enzyme
Mol. Mass.:
40130.14
Organism:
Rattus norvegicus (rat)
Description:
Rat brain cytosol as enzyme source.
Residue:
361
  
Inhibitor
Name:
BDBM50090850
Synonyms:
(2R,3S,4R,5R)-2-Aminomethyl-5-(6-amino-purin-9-yl)-tetrahydro-furan-3,4-diol 5'-amino-5'-deoxyadenosine | CHEMBL302376
Type:
Small organic molecule
Emp. Form.:
C10H14N6O3
Mol. Mass.:
266.2566
SMILES:
NC[C@H]1O[C@H]([C@H](O)[C@@H]1O)n1cnc2c(N)ncnc12
: