Target
Thymidine kinase
Ligand
BDBM50101050
Substrate
Meas. Tech.
ChEBML_210614
IC50
0.110000±n/a nM
Citation
 Martin, JALambert, RWMerrett, JHParkes, KEThomas, GJBaker, SJBushnell, DJCansfield, JEDunsdon, SJFreeman, ACHopkins, RAJohns, IRKeech, ESimmonite, HWalmsley, AWong Kai-In, PHolland, M Nucleoside analogues as highly potent and selective inhibitors of herpes simplex virus thymidine kinase. Bioorg Med Chem Lett 11:1655-8 (2001)  
Target
Name:
Thymidine kinase
Synonyms:
Type:
PROTEIN
Mol. Mass.:
40396.73
Organism:
Human herpesvirus 2
Description:
ChEMBL_474155
Residue:
376
  
Inhibitor
Name:
BDBM50101050
Synonyms:
10,10-Dioxo-9,10-dihydro-10lambda*6*-thioxanthene-9-carboxylic acid [(2R,3R,4S,5R)-5-(5-ethyl-2,4-dioxo-3,4-dihydro-2H-pyrimidin-1-yl)-4-fluoro-3-hydroxy-tetrahydro-furan-2-ylmethyl]-amide | CHEMBL290528
Type:
Small organic molecule
Emp. Form.:
C25H24FN3O7S
Mol. Mass.:
529.537
SMILES:
CCc1cn([C@@H]2O[C@H](CNC(=O)C3c4ccccc4S(=O)(=O)c4ccccc34)[C@@H](O)[C@@H]2F)c(=O)[nH]c1=O
: