Target
Serine protease 1
Ligand
BDBM50101132
Substrate
Meas. Tech.
ChEBML_212339
IC50
39±n/a nM
Citation
 Aoyama, YUenaka, MKonoike, THayasaki-Kajiwara, YNaya, NNakajima, M Inhibition of serine proteases: activity of 1,3-diazetidine-2,4-diones. Bioorg Med Chem Lett 11:1691-4 (2001)  
Target
Name:
Serine protease 1
Synonyms:
Beta-Trypsin PRSS1 TRY1 TRYP1 Trypsin I
Type:
Enzyme
Mol. Mass.:
25790.52
Organism:
Bos taurus (bovine)
Description:
P00760
Residue:
246
  
Inhibitor
Name:
BDBM50101132
Synonyms:
1,3-Dibenzyl-[1,3]diazetidine-2,4-dione | CHEMBL47394
Type:
Small organic molecule
Emp. Form.:
C16H14N2O2
Mol. Mass.:
266.2946
SMILES:
O=C1N(Cc2ccccc2)C(=O)N1Cc1ccccc1
: