Target
Chymase
Ligand
BDBM50101135
Substrate
Meas. Tech.
ChEBML_197650
IC50
2±n/a nM
Citation
 Aoyama, YUenaka, MKonoike, THayasaki-Kajiwara, YNaya, NNakajima, M Inhibition of serine proteases: activity of 1,3-diazetidine-2,4-diones. Bioorg Med Chem Lett 11:1691-4 (2001)  
Target
Name:
Chymase
Synonyms:
Alpha-chymase CMA1_HUMAN CYM Mast cell protease I
Type:
Enzyme
Mol. Mass.:
27340.12
Organism:
Homo sapiens (Human)
Description:
Residue:
247
  
Inhibitor
Name:
BDBM50101135
Synonyms:
1,3-Bis-(4-methoxy-benzyl)-[1,3]diazetidine-2,4-dione | CHEMBL48083
Type:
Small organic molecule
Emp. Form.:
C18H18N2O4
Mol. Mass.:
326.3465
SMILES:
COc1ccc(CN2C(=O)N(Cc3ccc(OC)cc3)C2=O)cc1
: