Target
Amyloid-beta precursor protein
Ligand
BDBM50101410
Substrate
Meas. Tech.
ChEMBL_35681 (CHEMBL649530)
Ki
0.11±n/a nM
Citation
 Lee, CWZhuang, ZPKung, MPPlössl, KSkovronsky, DGur, THou, CTrojanowski, JQLee, VMKung, HF Isomerization of (Z,Z) to (E,E)1-bromo-2,5-bis-(3-hydroxycarbonyl-4-hydroxy)styrylbenzene in strong base: probes for amyloid plaques in the brain. J Med Chem 44:2270-5 (2001)  
Target
Name:
Amyloid-beta precursor protein
Synonyms:
A4 ABPP AICD-50 AICD-59 AID(57) APP Alzheimer disease amyloid protein Amyloid beta Protein Amyloid beta protein Abeta(1-42) Amyloid intracellular domain 57 Amyloid protein (Abeta42b) Beta amyloid A4 protein Beta-APP42 Beta-amyloid protein 42 C83 CVAP Gamma Secretase Gamma-CTF(57) Gamma-secretase Gamma-secretase C-terminal fragment 57 P3(40) PN-II Protease nexin-II S-APP-beta Soluble APP-beta | beta-Amyloid Precursor Protein (APP)
Type:
Single-pass type I membrane protein
Mol. Mass.:
86890.41
Organism:
Homo sapiens (Human)
Description:
P05067
Residue:
770
  
Inhibitor
Name:
BDBM50101410
Synonyms:
(trans,trans)-1-bromo-2,5-bis-(3-hydroxycarbonyl-4-hydroxy)styrylbenzene CHEMBL74704
Type:
Small organic molecule
Emp. Form.:
C24H17BrO6
Mol. Mass.:
481.292
SMILES:
OC(=O)c1cc(\C=C\c2ccc(\C=C\c3ccc(O)c(c3)C(O)=O)c(Br)c2)ccc1O
: