Target
72 kDa type IV collagenase
Ligand
BDBM50101497
Substrate
Meas. Tech.
ChEMBL_104539 (CHEMBL718926)
Ki
0.05±n/a nM
Citation
 Terp, GEJohansen, BNChristensen, ITJørgensen, FS A new concept for multidimensional selection of ligand conformations (MultiSelect) and multidimensional scoring (MultiScore) of protein-ligand binding affinities. J Med Chem 44:2333-43 (2001)  
Target
Name:
72 kDa type IV collagenase
Synonyms:
72 kDa gelatinase CLG4A Gelatinase A (MMP-2) MMP2_HUMAN Matrix metalloproteinase-2 (MMP 2) Matrix metalloproteinases 2 (MMP-2) | TBE-1
Type:
Enzyme
Mol. Mass.:
73870.36
Organism:
Homo sapiens (Human)
Description:
P08253
Residue:
660
  
Inhibitor
Name:
BDBM50101497
Synonyms:
2-[3-(4-Chloro-phenyl)-propyl]-N*1*-{2-cyclohexyl-1-[2-(4-dimethylamino-butylcarbamoyl)-ethylcarbamoyl]-ethyl}-N*4*-hydroxy-succinamide | CHEMBL77659
Type:
Small organic molecule
Emp. Form.:
C31H50ClN5O5
Mol. Mass.:
608.212
SMILES:
CN(C)CCCCNC(=O)CCNC(=O)[C@H](CC1CCCCC1)NC(=O)[C@H](CCCc1ccc(Cl)cc1)CC(=O)NO
: