Target
Neuropeptide Y receptor type 5
Ligand
BDBM50101538
Substrate
Meas. Tech.
ChEMBL_143298 (CHEMBL872841)
IC50
507±n/a nM
Citation
 Fotsch, CSonnenberg, JDChen, NHale, CKarbon, WNorman, MH Synthesis and structure-activity relationships of trisubstituted phenyl urea derivatives as neuropeptide Y5 receptor antagonists. J Med Chem 44:2344-56 (2001)  
Target
Name:
Neuropeptide Y receptor type 5
Synonyms:
NPY-Y5 NPY5-R NPY5R_HUMAN NPYY5 Neuropeptide Y receptor type 5 ( NPY Y5) | Y5 receptor
Type:
Enzyme
Mol. Mass.:
50746.64
Organism:
Homo sapiens (Human)
Description:
Q15761
Residue:
445
  
Inhibitor
Name:
BDBM50101538
Synonyms:
1-(2-Hydroxy-1-methyl-2-phenyl-ethyl)-1-methyl-3-(4-phenoxy-phenyl)-urea | CHEMBL308625
Type:
Small organic molecule
Emp. Form.:
C23H24N2O3
Mol. Mass.:
376.4483
SMILES:
C[C@@H]([C@@H](O)c1ccccc1)N(C)C(=O)Nc1ccc(Oc2ccccc2)cc1
: