Target
Neuropeptide Y receptor type 5
Ligand
BDBM50101564
Substrate
Meas. Tech.
ChEMBL_143298 (CHEMBL872841)
IC50
380±n/a nM
Citation
 Fotsch, CSonnenberg, JDChen, NHale, CKarbon, WNorman, MH Synthesis and structure-activity relationships of trisubstituted phenyl urea derivatives as neuropeptide Y5 receptor antagonists. J Med Chem 44:2344-56 (2001)  
Target
Name:
Neuropeptide Y receptor type 5
Synonyms:
NPY-Y5 NPY5-R NPY5R_HUMAN NPYY5 Neuropeptide Y receptor type 5 ( NPY Y5) | Y5 receptor
Type:
Enzyme
Mol. Mass.:
50746.64
Organism:
Homo sapiens (Human)
Description:
Q15761
Residue:
445
  
Inhibitor
Name:
BDBM50101564
Synonyms:
1-(1-Benzyl-2-methyl-propyl)-1-methyl-3-(4-phenoxy-phenyl)-urea | CHEMBL76439
Type:
Small organic molecule
Emp. Form.:
C25H28N2O2
Mol. Mass.:
388.502
SMILES:
CC(C)C(Cc1ccccc1)N(C)C(=O)Nc1ccc(Oc2ccccc2)cc1
: