Target
Neuropeptide Y receptor type 1
Ligand
BDBM50101546
Substrate
Meas. Tech.
ChEMBL_143296 (CHEMBL748122)
IC50
>10000±n/a nM
Citation
 Fotsch, CSonnenberg, JDChen, NHale, CKarbon, WNorman, MH Synthesis and structure-activity relationships of trisubstituted phenyl urea derivatives as neuropeptide Y5 receptor antagonists. J Med Chem 44:2344-56 (2001)  
Target
Name:
Neuropeptide Y receptor type 1
Synonyms:
NPY-Y1 NPY1R NPYR neuropeptide Y receptor Y1
Type:
Enzyme Catalytic Domain
Mol. Mass.:
44399.07
Organism:
Homo sapiens (Human)
Description:
NPY-Y1 NPY1R HUMAN::P25929
Residue:
384
  
Inhibitor
Name:
BDBM50101546
Synonyms:
1-(1-Benzyl-propyl)-1-methyl-3-(4-phenoxy-phenyl)-urea | CHEMBL77589
Type:
Small organic molecule
Emp. Form.:
C24H26N2O2
Mol. Mass.:
374.4754
SMILES:
CCC(Cc1ccccc1)N(C)C(=O)Nc1ccc(Oc2ccccc2)cc1
: