Target
Neuropeptide Y receptor type 2
Ligand
BDBM50101537
Substrate
Meas. Tech.
ChEMBL_143297 (CHEMBL749564)
IC50
>10000±n/a nM
Citation
 Fotsch, CSonnenberg, JDChen, NHale, CKarbon, WNorman, MH Synthesis and structure-activity relationships of trisubstituted phenyl urea derivatives as neuropeptide Y5 receptor antagonists. J Med Chem 44:2344-56 (2001)  
Target
Name:
Neuropeptide Y receptor type 2
Synonyms:
NPY-Y2 NPY2-R NPY2R_HUMAN Y2 receptor | neuropeptide Y receptor Y2
Type:
Enzyme Catalytic Domain
Mol. Mass.:
42734.65
Organism:
Homo sapiens (Human)
Description:
NPY-Y2 NPY2R HUMAN::P49146
Residue:
381
  
Inhibitor
Name:
BDBM50101537
Synonyms:
3-[4-(4-Chloro-phenoxy)-phenyl]-1-(2-hydroxy-1-methyl-2-phenyl-ethyl)-1-methyl-urea | CHEMBL78109
Type:
Small organic molecule
Emp. Form.:
C23H23ClN2O3
Mol. Mass.:
410.893
SMILES:
C[C@H]([C@@H](O)c1ccccc1)N(C)C(=O)Nc1ccc(Oc2ccc(Cl)cc2)cc1
: