Target
Neuropeptide Y receptor type 2
Ligand
BDBM50101533
Substrate
Meas. Tech.
ChEMBL_143297 (CHEMBL749564)
IC50
>10000±n/a nM
Citation
 Fotsch, CSonnenberg, JDChen, NHale, CKarbon, WNorman, MH Synthesis and structure-activity relationships of trisubstituted phenyl urea derivatives as neuropeptide Y5 receptor antagonists. J Med Chem 44:2344-56 (2001)  
Target
Name:
Neuropeptide Y receptor type 2
Synonyms:
NPY-Y2 NPY2-R NPY2R_HUMAN Y2 receptor | neuropeptide Y receptor Y2
Type:
Enzyme Catalytic Domain
Mol. Mass.:
42734.65
Organism:
Homo sapiens (Human)
Description:
NPY-Y2 NPY2R HUMAN::P49146
Residue:
381
  
Inhibitor
Name:
BDBM50101533
Synonyms:
1-[2-(4-Chloro-phenyl)-1-methyl-ethyl]-1-methyl-3-(4-phenoxy-phenyl)-urea | CHEMBL442182
Type:
Small organic molecule
Emp. Form.:
C23H23ClN2O2
Mol. Mass.:
394.894
SMILES:
CC(Cc1ccc(Cl)cc1)N(C)C(=O)Nc1ccc(Oc2ccccc2)cc1
: