Target
5-hydroxytryptamine receptor 1A
Ligand
BDBM50101652
Substrate
Meas. Tech.
ChEMBL_929 (CHEMBL615777)
Ki
24.12±n/a nM
Citation
 Barlocco, DCignarella, GPiaz, VDGiovannoni, MPDe Benedetti, PGFanelli, FMontesano, FPoggesi, ELeonardi, A Phenylpiperazinylalkylamino substituted pyridazinones as potent alpha(1) adrenoceptor antagonists. J Med Chem 44:2403-10 (2001)  
Target
Name:
5-hydroxytryptamine receptor 1A
Synonyms:
5-HT-1A 5-hydroxytryptamine receptor 1A (5-HT-1A) ADRB2RL1 Dopamine D2 receptor and serotonin 1a receptor HTR1A | Serotonin receptor 1A
Type:
Mol. Mass.:
46122.49
Organism:
Homo sapiens (Human)
Description:
Residue:
422
  
Inhibitor
Name:
BDBM50101652
Synonyms:
5-Acetyl-4-{2-[4-(2-fluoro-phenyl)-piperazin-1-yl]-ethylamino}-2-methyl-6-phenyl-2H-pyridazin-3-one | CHEMBL420205
Type:
Small organic molecule
Emp. Form.:
C25H28FN5O2
Mol. Mass.:
449.5205
SMILES:
CC(=O)c1c(NCCN2CCN(CC2)c2ccccc2F)c(=O)n(C)nc1-c1ccccc1
: