Target
Alpha-1A adrenergic receptor
Ligand
BDBM50101657
Substrate
Meas. Tech.
ChEMBL_216130 (CHEMBL816950)
Ki
0.19±n/a nM
Citation
 Barlocco, DCignarella, GPiaz, VDGiovannoni, MPDe Benedetti, PGFanelli, FMontesano, FPoggesi, ELeonardi, A Phenylpiperazinylalkylamino substituted pyridazinones as potent alpha(1) adrenoceptor antagonists. J Med Chem 44:2403-10 (2001)  
Target
Name:
Alpha-1A adrenergic receptor
Synonyms:
ADA1A_HUMAN ADRA1C Alpha 1A-adrenoceptor Alpha adrenergic receptor 1a Alpha-adrenergic receptor 1c adrenergic Alpha1 | adrenergic Alpha1C
Type:
Cell-surface receptors
Mol. Mass.:
51511.67
Organism:
Homo sapiens (Human)
Description:
P35348
Residue:
466
  
Inhibitor
Name:
BDBM50101657
Synonyms:
4-{2-[4-(2-Methoxy-phenyl)-piperazin-1-yl]-ethylamino}-2-methyl-6-phenyl-5-propionyl-2H-pyridazin-3-one | CHEMBL78874
Type:
Small organic molecule
Emp. Form.:
C27H33N5O3
Mol. Mass.:
475.5826
SMILES:
CCC(=O)c1c(NCCN2CCN(CC2)c2ccccc2OC)c(=O)n(C)nc1-c1ccccc1
: