Target
Adenosine receptor A1
Ligand
BDBM50101789
Substrate
Meas. Tech.
ChEBML_29638
Ki
86±n/a nM
Citation
 van Tilburg, EWvan der Klein, PAde Groote, MBeukers, MWIJzerman, AP Substituted 4-phenyl-2-(phenylcarboxamido)-1,3-thiazole derivatives as antagonists for the adenosine A(1) receptor. Bioorg Med Chem Lett 11:2017-9 (2001)  
Target
Name:
Adenosine receptor A1
Synonyms:
AA1R_RAT ADENOSINE A1 high Adenosine A1 receptor (A1) Adenosine receptors A1 | Adora1
Type:
Protein
Mol. Mass.:
36704.13
Organism:
Rattus norvegicus (rat)
Description:
Residue:
326
  
Inhibitor
Name:
BDBM50101789
Synonyms:
3-Chloro-N-(4-phenyl-thiazol-2-yl)-benzamide | CHEMBL61222
Type:
Small organic molecule
Emp. Form.:
C16H11ClN2OS
Mol. Mass.:
314.789
SMILES:
Clc1cccc(c1)C(=O)Nc1nc(cs1)-c1ccccc1
: