Target
Adenosine receptor A3
Ligand
BDBM50097431
Substrate
Meas. Tech.
ChEBML_29903
Ki
670±n/a nM
Citation
 van Tilburg, EWvan der Klein, PAde Groote, MBeukers, MWIJzerman, AP Substituted 4-phenyl-2-(phenylcarboxamido)-1,3-thiazole derivatives as antagonists for the adenosine A(1) receptor. Bioorg Med Chem Lett 11:2017-9 (2001)  
Target
Name:
Adenosine receptor A3
Synonyms:
A3 adenosine receptor (hA3) ADORA3 | Adenosine A3 receptor (A3AR)
Type:
G Protein-Coupled Receptor (GPCR)
Mol. Mass.:
36197.32
Organism:
Homo sapiens (Human)
Description:
P0DMS8
Residue:
318
  
Inhibitor
Name:
BDBM50097431
Synonyms:
4-Methoxy-N-(4-phenyl-thiazol-2-yl)-benzamide 4-methoxy-N-(4-phenylthiazol-2-yl)benzamide LUF-5433
Type:
Small organic molecule
Emp. Form.:
C17H14N2O2S
Mol. Mass.:
310.37
SMILES:
COc1ccc(cc1)C(=O)Nc1nc(cs1)-c1ccccc1
: