Target
Prostaglandin E2 receptor EP4 subtype
Ligand
BDBM50101861
Substrate
Meas. Tech.
ChEMBL_158451 (CHEMBL763255)
Ki
0.500000±n/a nM
Citation
 Maruyama, TAsada, MShiraishi, TSakata, KSeki, AYoshida, HShinagawa, YMaruyama, TOhuchida, SNakai, HKondo, KToda, M Design and synthesis of a highly selective EP4-receptor agonist. Part 2: 5-thia and 9beta-haloPG derivatives with improved stability. Bioorg Med Chem Lett 11:2033-5 (2001)  
Target
Name:
Prostaglandin E2 receptor EP4 subtype
Synonyms:
PE2R4_MOUSE Prostanoid EP4 receptor Ptgerep4
Type:
G-protein coupled receptor
Mol. Mass.:
56175.66
Organism:
Mus musculus (Mouse)
Description:
Residue:
513
  
Inhibitor
Name:
BDBM50101861
Synonyms:
4-{(S)-2-[(R)-3-Hydroxy-2-((1R,2R)-3-hydroxy-oct-1-enyl)-5-oxo-cyclopentyl]-ethylsulfanyl}-butyric acid | CHEMBL64187
Type:
Small organic molecule
Emp. Form.:
C19H32O5S
Mol. Mass.:
372.519
SMILES:
CCCCC[C@H](O)\C=C\[C@H]1[C@H](O)CC(=O)[C@@H]1CCSCCCC(O)=O
: