Target
Prostaglandin E2 receptor EP3 subtype
Ligand
BDBM50101858
Substrate
Meas. Tech.
ChEBML_158325
Ki
56±n/a nM
Citation
 Maruyama, TAsada, MShiraishi, TSakata, KSeki, AYoshida, HShinagawa, YMaruyama, TOhuchida, SNakai, HKondo, KToda, M Design and synthesis of a highly selective EP4-receptor agonist. Part 2: 5-thia and 9beta-haloPG derivatives with improved stability. Bioorg Med Chem Lett 11:2033-5 (2001)  
Target
Name:
Prostaglandin E2 receptor EP3 subtype
Synonyms:
PE2R3_MOUSE Prostaglandin E2 receptor EP3 isoform alpha Prostanoid EP3 receptor Ptgerep3
Type:
G-protein coupled receptor
Mol. Mass.:
40092.50
Organism:
Mus musculus (Mouse)
Description:
Residue:
365
  
Inhibitor
Name:
BDBM50101858
Synonyms:
4-(2-((1R,2R,3R)-3-hydroxy-2-((S,E)-3-hydroxy-4-(3-(methoxymethyl)phenyl)but-1-enyl)-5-oxocyclopentyl)ethylthio)butanoic acid CHEMBL292964
Type:
Small organic molecule
Emp. Form.:
C23H32O6S
Mol. Mass.:
436.562
SMILES:
COCc1cccc(C[C@H](O)\C=C\[C@H]2[C@H](O)CC(=O)[C@@H]2CCSCCCC(O)=O)c1
: